Reaction Details
TargetSubstance-P receptor
LigandBDBM50217053
Substrate/Competitorn/a
Meas. Tech.ChEMBL_205899 (CHEMBL814483)
Ki 31±n/a nM
Citation Bleicher, KHWüthrich, YAdam, GHoffmann, TSleight, AJ Parallel solution- and solid-phase synthesis of spiropyrrolo-pyrroles as novel neurokinin receptor ligands. Bioorg Med Chem Lett12:3073-6 (2002) Substance-P receptor
Name:Substance-P receptor
Type:G Protein-Coupled Receptor (GPCR)
Mol. Mass.:46254.43
Organism:Homo sapiens (Human)
Description:P25103
Residue:407
BDBM50217053
NameBDBM50217053
Synonyms:CHEMBL102917
TypeSmall organic molecule
Emp. Form.C33H26F6N4O7S
Mol. Mass.736.638
SMILESFC(F)(F)c1cc(cc(c1)C(F)(F)F)C(=O)N1CC2C(C(=O)N(C2=O)c2ccccc2)C11CCN(CC1)S(=O)(=O)c1ccc2OCC(=O)Nc2c1