Reaction Details
TargetSubstance-P receptor
LigandBDBM50217088
Substrate/Competitorn/a
Meas. Tech.ChEMBL_205899 (CHEMBL814483)
Ki 4266±n/a nM
Citation Bleicher, KHWüthrich, YAdam, GHoffmann, TSleight, AJ Parallel solution- and solid-phase synthesis of spiropyrrolo-pyrroles as novel neurokinin receptor ligands. Bioorg Med Chem Lett12:3073-6 (2002) Substance-P receptor
Name:Substance-P receptor
Type:G Protein-Coupled Receptor (GPCR)
Mol. Mass.:46254.43
Organism:Homo sapiens (Human)
Description:P25103
Residue:407
BDBM50217088
NameBDBM50217088
Synonyms:CHEMBL102332
TypeSmall organic molecule
Emp. Form.C28H27F6N3O5
Mol. Mass.599.5215
SMILESCOc1ccc(cc1OC)C(=O)N1CC2C(C(=O)N(Cc3cc(cc(c3)C(F)(F)F)C(F)(F)F)C2=O)C11CCNCC1