Reaction Details
TargetSubstance-P receptor
LigandBDBM50217091
Substrate/Competitorn/a
Meas. Tech.ChEMBL_205899 (CHEMBL814483)
Ki 76±n/a nM
Citation Bleicher, KHWüthrich, YAdam, GHoffmann, TSleight, AJ Parallel solution- and solid-phase synthesis of spiropyrrolo-pyrroles as novel neurokinin receptor ligands. Bioorg Med Chem Lett12:3073-6 (2002) Substance-P receptor
Name:Substance-P receptor
Type:G Protein-Coupled Receptor (GPCR)
Mol. Mass.:46254.43
Organism:Homo sapiens (Human)
Description:P25103
Residue:407
BDBM50217091
NameBDBM50217091
Synonyms:CHEMBL322453
TypeSmall organic molecule
Emp. Form.C30H26F6N4O6S
Mol. Mass.684.606
SMILESCc1noc(C)c1S(=O)(=O)N1CCC2(CC1)C1C(CN2C(=O)c2cc(cc(c2)C(F)(F)F)C(F)(F)F)C(=O)N(C1=O)c1ccccc1