Reaction Details
TargetSubstance-P receptor
LigandBDBM50217095
Substrate/Competitorn/a
Meas. Tech.ChEMBL_205899 (CHEMBL814483)
Ki 1072±n/a nM
Citation Bleicher, KHWüthrich, YAdam, GHoffmann, TSleight, AJ Parallel solution- and solid-phase synthesis of spiropyrrolo-pyrroles as novel neurokinin receptor ligands. Bioorg Med Chem Lett12:3073-6 (2002) Substance-P receptor
Name:Substance-P receptor
Type:G Protein-Coupled Receptor (GPCR)
Mol. Mass.:46254.43
Organism:Homo sapiens (Human)
Description:P25103
Residue:407
BDBM50217095
NameBDBM50217095
Synonyms:CHEMBL105055
TypeSmall organic molecule
Emp. Form.C27H23F6N3O4
Mol. Mass.567.4796
SMILESCC(=O)N1CCC2(CC1)C1C(CN2C(=O)c2cc(cc(c2)C(F)(F)F)C(F)(F)F)C(=O)N(C1=O)c1ccccc1