Reaction Details
TargetHistamine H2 receptor
LigandBDBM50217096
Substrate/Competitorn/a
Meas. Tech.ChEMBL_85805 (CHEMBL697083)
Ki 7413±n/a nM
Citation Faghih, RDwight, WVasudevan, ADinges, JConner, SEEsbenshade, TABennani, YLHancock, AA Aminoalkoxybiphenylnitriles as histamine-3 receptor ligands. Bioorg Med Chem Lett12:3077-9 (2002) Histamine H2 receptor
Name:Histamine H2 receptor
Type:G Protein-Coupled Receptor (GPCR)
Mol. Mass.:40115.31
Organism:Homo sapiens (Human)
Description:n/a
Residue:359
BDBM50217096
NameBDBM50217096
Synonyms:CHEMBL105267
TypeSmall organic molecule
Emp. Form.C20H23N3O
Mol. Mass.321.4161
SMILESN[C@@H]1CCN(CCCOc2ccc(cc2)-c2ccc(cc2)C#N)C1