Reaction Details
TargetHistamine H3 receptor
LigandBDBM50217098
Substrate/Competitorn/a
Meas. Tech.ChEMBL_86929 (CHEMBL697538)
Ki 2754±n/a nM
Citation Faghih, RDwight, WVasudevan, ADinges, JConner, SEEsbenshade, TABennani, YLHancock, AA Aminoalkoxybiphenylnitriles as histamine-3 receptor ligands. Bioorg Med Chem Lett12:3077-9 (2002) Histamine H3 receptor
Name:Histamine H3 receptor
Type:G Protein-Coupled Receptor (GPCR)
Mol. Mass.:48607.98
Organism:Rattus norvegicus (rat)
Description:n/a
Residue:445
BDBM50217098
NameBDBM50217098
Synonyms:CHEMBL419912
TypeSmall organic molecule
Emp. Form.C21H27N3O3
Mol. Mass.369.4574
SMILESCCOC(=O)N1CCN(CCCOc2ccc(cc2)-c2ccncc2)CC1