Reaction Details
TargetHistamine H3 receptor
LigandBDBM50217101
Substrate/Competitorn/a
Meas. Tech.ChEMBL_85806 (CHEMBL697084)
Ki 7.2±n/a nM
Citation Faghih, RDwight, WVasudevan, ADinges, JConner, SEEsbenshade, TABennani, YLHancock, AA Aminoalkoxybiphenylnitriles as histamine-3 receptor ligands. Bioorg Med Chem Lett12:3077-9 (2002) Histamine H3 receptor
Name:Histamine H3 receptor
Type:G Protein-Coupled Receptor (GPCR)
Mol. Mass.:48691.47
Organism:Homo sapiens (Human)
Description:Binding assays were using CHO cells stably expressing hH3R receptors.
Residue:445
BDBM50217101
NameBDBM50217101
Synonyms:CHEMBL25688
TypeSmall organic molecule
Emp. Form.C20H22N2O
Mol. Mass.306.4015
SMILESN#Cc1ccc(cc1)-c1ccc(OCCCN2CCCC2)cc1