Reaction Details
TargetHistamine H1 receptor
LigandBDBM50217102
Substrate/Competitorn/a
Meas. Tech.ChEMBL_85804 (CHEMBL697082)
Ki 5623±n/a nM
Citation Faghih, RDwight, WVasudevan, ADinges, JConner, SEEsbenshade, TABennani, YLHancock, AA Aminoalkoxybiphenylnitriles as histamine-3 receptor ligands. Bioorg Med Chem Lett12:3077-9 (2002) Histamine H1 receptor
Name:Histamine H1 receptor
Type:G Protein-Coupled Receptor (GPCR)
Mol. Mass.:55808.72
Organism:Homo sapiens (Human)
Description:Cell pellets from SK-N-MC cells transfected with human H1 receptor were used in binding assay.
Residue:487
BDBM50217102
NameBDBM50217102
Synonyms:CHEMBL318801
TypeSmall organic molecule
Emp. Form.C20H22N2O2
Mol. Mass.322.4009
SMILESO[C@H]1CCN(CCCOc2ccc(cc2)-c2ccc(cc2)C#N)C1