Reaction Details
TargetHistamine H2 receptor
LigandBDBM50217109
Substrate/Competitorn/a
Meas. Tech.ChEMBL_85657 (CHEMBL702649)
Ki 3631±n/a nM
Citation Faghih, RDwight, WVasudevan, ADinges, JConner, SEEsbenshade, TABennani, YLHancock, AA Aminoalkoxybiphenylnitriles as histamine-3 receptor ligands. Bioorg Med Chem Lett12:3077-9 (2002) Histamine H2 receptor
Name:Histamine H2 receptor
Type:G Protein-Coupled Receptor (GPCR)
Mol. Mass.:40115.31
Organism:Homo sapiens (Human)
Description:n/a
Residue:359
BDBM50217109
NameBDBM50217109
Synonyms:CHEMBL446885
TypeSmall organic molecule
Emp. Form.C23H27F3N2O4
Mol. Mass.452.4667
SMILESCCOC(=O)N1CCN(CCCOc2ccc(cc2)-c2ccc(OC(F)(F)F)cc2)CC1