Reaction Details
TargetHistamine H2 receptor
LigandBDBM50217413
Substrate/Competitorn/a
Meas. Tech.ChEMBL_85657 (CHEMBL702649)
Ki 15136±n/a nM
Citation Faghih, RDwight, WVasudevan, ADinges, JConner, SEEsbenshade, TABennani, YLHancock, AA Aminoalkoxybiphenylnitriles as histamine-3 receptor ligands. Bioorg Med Chem Lett12:3077-9 (2002) Histamine H2 receptor
Name:Histamine H2 receptor
Type:G Protein-Coupled Receptor (GPCR)
Mol. Mass.:40115.31
Organism:Homo sapiens (Human)
Description:n/a
Residue:359
BDBM50217413
NameBDBM50217413
Synonyms:CHEMBL2112461
TypeSmall organic molecule
Emp. Form.C21H24N2O2
Mol. Mass.336.4275
SMILESC[C@@]1(O)CCN(CCCOc2ccc(cc2)-c2ccc(cc2)C#N)C1