Reaction Details
TargetHistamine H1 receptor
LigandBDBM50217487
Substrate/Competitorn/a
Meas. Tech.ChEMBL_85804 (CHEMBL697082)
Ki 380±n/a nM
Citation Faghih, RDwight, WVasudevan, ADinges, JConner, SEEsbenshade, TABennani, YLHancock, AA Aminoalkoxybiphenylnitriles as histamine-3 receptor ligands. Bioorg Med Chem Lett12:3077-9 (2002) Histamine H1 receptor
Name:Histamine H1 receptor
Type:G Protein-Coupled Receptor (GPCR)
Mol. Mass.:55808.72
Organism:Homo sapiens (Human)
Description:Cell pellets from SK-N-MC cells transfected with human H1 receptor were used in binding assay.
Residue:487
BDBM50217487
NameBDBM50217487
Synonyms:CHEMBL105268
TypeSmall organic molecule
Emp. Form.C23H27N3O3
Mol. Mass.393.4788
SMILESCCOC(=O)N1CCN(CCCOc2ccc(cc2)-c2cccc(c2)C#N)CC1