Reaction Details
TargetHistamine H3 receptor
LigandBDBM50217411
Substrate/Competitorn/a
Meas. Tech.ChEMBL_83794 (CHEMBL692571)
Ki 14±n/a nM
Citation Faghih, RDwight, WVasudevan, ADinges, JConner, SEEsbenshade, TABennani, YLHancock, AA Aminoalkoxybiphenylnitriles as histamine-3 receptor ligands. Bioorg Med Chem Lett12:3077-9 (2002) Histamine H3 receptor
Name:Histamine H3 receptor
Type:G Protein-Coupled Receptor (GPCR)
Mol. Mass.:48691.47
Organism:Homo sapiens (Human)
Description:Binding assays were using CHO cells stably expressing hH3R receptors.
Residue:445
BDBM50217411
NameBDBM50217411
Synonyms:CHEMBL323562
TypeSmall organic molecule
Emp. Form.C22H26N2O
Mol. Mass.334.4546
SMILESCC1CCN(CCCOc2ccc(cc2)-c2ccc(cc2)C#N)CC1