Reaction Details
TargetHistamine H1 receptor
LigandBDBM50217096
Substrate/Competitorn/a
Meas. Tech.ChEMBL_85804 (CHEMBL697082)
Ki 13804±n/a nM
Citation Faghih, RDwight, WVasudevan, ADinges, JConner, SEEsbenshade, TABennani, YLHancock, AA Aminoalkoxybiphenylnitriles as histamine-3 receptor ligands. Bioorg Med Chem Lett12:3077-9 (2002) Histamine H1 receptor
Name:Histamine H1 receptor
Type:G Protein-Coupled Receptor (GPCR)
Mol. Mass.:55808.72
Organism:Homo sapiens (Human)
Description:Cell pellets from SK-N-MC cells transfected with human H1 receptor were used in binding assay.
Residue:487
BDBM50217096
NameBDBM50217096
Synonyms:CHEMBL105267
TypeSmall organic molecule
Emp. Form.C20H23N3O
Mol. Mass.321.4161
SMILESN[C@@H]1CCN(CCCOc2ccc(cc2)-c2ccc(cc2)C#N)C1