Reaction Details
TargetHistamine H3 receptor
LigandBDBM50217500
Substrate/Competitorn/a
Meas. Tech.ChEMBL_85807 (CHEMBL697085)
Ki 98±n/a nM
Citation Faghih, RDwight, WVasudevan, ADinges, JConner, SEEsbenshade, TABennani, YLHancock, AA Aminoalkoxybiphenylnitriles as histamine-3 receptor ligands. Bioorg Med Chem Lett12:3077-9 (2002) Histamine H3 receptor
Name:Histamine H3 receptor
Type:G Protein-Coupled Receptor (GPCR)
Mol. Mass.:48607.98
Organism:Rattus norvegicus (rat)
Description:n/a
Residue:445
BDBM50217500
NameBDBM50217500
Synonyms:CHEMBL318320
TypeSmall organic molecule
Emp. Form.C22H27N3O5
Mol. Mass.413.4669
SMILESCCOC(=O)N1CCN(CCCOc2ccc(cc2)-c2ccc(cc2)[N+]([O-])=O)CC1