Reaction Details
TargetHistamine H2 receptor
LigandBDBM50217411
Substrate/Competitorn/a
Meas. Tech.ChEMBL_85657 (CHEMBL702649)
Ki 9120±n/a nM
Citation Faghih, RDwight, WVasudevan, ADinges, JConner, SEEsbenshade, TABennani, YLHancock, AA Aminoalkoxybiphenylnitriles as histamine-3 receptor ligands. Bioorg Med Chem Lett12:3077-9 (2002) Histamine H2 receptor
Name:Histamine H2 receptor
Type:G Protein-Coupled Receptor (GPCR)
Mol. Mass.:40115.31
Organism:Homo sapiens (Human)
Description:n/a
Residue:359
BDBM50217411
NameBDBM50217411
Synonyms:CHEMBL323562
TypeSmall organic molecule
Emp. Form.C22H26N2O
Mol. Mass.334.4546
SMILESCC1CCN(CCCOc2ccc(cc2)-c2ccc(cc2)C#N)CC1