Reaction Details
TargetHistamine H3 receptor
LigandBDBM50217106
Substrate/Competitorn/a
Meas. Tech.ChEMBL_86929 (CHEMBL697538)
Ki 112±n/a nM
Citation Faghih, RDwight, WVasudevan, ADinges, JConner, SEEsbenshade, TABennani, YLHancock, AA Aminoalkoxybiphenylnitriles as histamine-3 receptor ligands. Bioorg Med Chem Lett12:3077-9 (2002) Histamine H3 receptor
Name:Histamine H3 receptor
Type:G Protein-Coupled Receptor (GPCR)
Mol. Mass.:48607.98
Organism:Rattus norvegicus (rat)
Description:n/a
Residue:445
BDBM50217106
NameBDBM50217106
Synonyms:CHEMBL317900
TypeSmall organic molecule
Emp. Form.C22H27BrN2O3
Mol. Mass.447.365
SMILESCCOC(=O)N1CCN(CCCOc2ccc(cc2)-c2ccc(Br)cc2)CC1