Reaction Details
TargetTryptase delta
LigandBDBM50217624
Substrate/Competitorn/a
Meas. Tech.ChEMBL_88854 (CHEMBL697873)
IC50 4.0±n/a nM
Citation Sutton, JCBolton, SAHartl, KSHuang, MHJacobs, GMeng, WOgletree, MLPi, ZSchumacher, WASeiler, SMSlusarchyk, WATreuner, UZahler, RZhao, GBisacchi, GS Synthesis and SAR of 4-carboxy-2-azetidinone mechanism-based tryptase inhibitors. Bioorg Med Chem Lett12:3229-33 (2002) Tryptase delta
Name:Tryptase delta
Type:PROTEIN
Mol. Mass.:26578.73
Organism:Homo sapiens (Human)
Description:ChEMBL_104777
Residue:242
BDBM50217624
NameBDBM50217624
Synonyms:CHEMBL321622
TypeSmall organic molecule
Emp. Form.C18H30N6O6
Mol. Mass.426.4674
SMILES[#6]C([#6])([#6])[#8]-[#6](=O)-[#7]-1-[#6]-[#6]-[#7](-[#6]-[#6]-1)-[#6](=O)-[#7]-1-[#6@@H](-[#6@@H](-[#6]-[#6]-[#6]\[#7]=[#6](/[#7])-[#7])-[#6]-1=O)-[#6](-[#8])=O