Reaction Details
TargetTryptase delta
LigandBDBM50217822
Substrate/Competitorn/a
Meas. Tech.ChEMBL_210701 (CHEMBL817298)
IC50<1.7±n/a nM
Citation Slusarchyk, WABolton, SAHartl, KSHuang, MHJacobs, GMeng, WOgletree, MLPi, ZSchumacher, WASeiler, SMSutton, JCTreuner, UZahler, RZhao, GBisacchi, GS Synthesis of potent and highly selective inhibitors of human tryptase. Bioorg Med Chem Lett12:3235-8 (2002) Tryptase delta
Name:Tryptase delta
Type:PROTEIN
Mol. Mass.:26578.73
Organism:Homo sapiens (Human)
Description:ChEMBL_104777
Residue:242
BDBM50217822
NameBDBM50217822
Synonyms:CHEMBL111173
TypeSmall organic molecule
Emp. Form.C27H39N7O5
Mol. Mass.541.6425
SMILESNC(=N)N1CCCC(C[C@@H]2[C@H](N(C(=O)N3CCN(CC3)C(=O)NCCCCc3ccccc3)C2=O)C(O)=O)C1