Reaction Details
Target5-hydroxytryptamine receptor 7
LigandBDBM50217832
Substrate/Competitorn/a
Meas. Tech.ChEMBL_3727 (CHEMBL619899)
Ki 0.794328±n/a nM
Citation Forbes, ITDouglas, SGribble, ADIfe, RJLightfoot, APGarner, AERiley, GJJeffrey, PStevens, AJStean, TOThomas, DR SB-656104-A: a novel 5-HT(7) receptor antagonist with improved in vivo properties. Bioorg Med Chem Lett12:3341-4 (2002) 5-hydroxytryptamine receptor 7
Name:5-hydroxytryptamine receptor 7
Type:G Protein-Coupled Receptor (GPCR)
Mol. Mass.:53573.08
Organism:Homo sapiens (Human)
Description:P34969
Residue:479
BDBM50217832
NameBDBM50217832
Synonyms:CHEMBL116292
TypeSmall organic molecule
Emp. Form.C26H30ClN3O3S
Mol. Mass.500.053
SMILESClc1ccc(cc1)C(=O)C1CCN(CC[C@H]2CCCN2S(=O)(=O)c2ccc3cc[nH]c3c2)CC1