Reaction Details
TargetIsoleucyl-tRNA synthetase
LigandBDBM50217849
Substrate/Competitorn/a
Meas. Tech.ChEMBL_88825 (CHEMBL698880)
IC50 244±n/a nM
Citation Shimizu, TUsui, TMachida, KFuruya, KOsada, HNakata, T Chemical modification of reveromycin A and its biological activities. Bioorg Med Chem Lett12:3363-6 (2002) Isoleucyl-tRNA synthetase
Name:Isoleucyl-tRNA synthetase
Synonyms:n/a
Type:PROTEIN
Mol. Mass.:5742.00
Organism:Rattus norvegicus
Description:ChEMBL_88824
Residue:50
BDBM50217849
NameBDBM50217849
Synonyms:CHEMBL115317
TypeSmall organic molecule
Emp. Form.C37H54O11
Mol. Mass.674.8181
SMILES[H][C@]1(C\C=C(/C)\C=C\[C@H](OC)[C@@H](C)\C=C\C(O)=O)O[C@]2(CC[C@@H]1C)CC[C@@](CCCC)(OC(=O)CCC(O)=O)[C@@]([H])(O2)\C=C\C(\C)=C\C(O)=O