Reaction Details
TargetIsoleucyl-tRNA synthetase
LigandBDBM50217933
Substrate/Competitorn/a
Meas. Tech.ChEMBL_88825 (CHEMBL698880)
IC50<1330±n/a nM
Citation Shimizu, TUsui, TMachida, KFuruya, KOsada, HNakata, T Chemical modification of reveromycin A and its biological activities. Bioorg Med Chem Lett12:3363-6 (2002) Isoleucyl-tRNA synthetase
Name:Isoleucyl-tRNA synthetase
Synonyms:n/a
Type:PROTEIN
Mol. Mass.:5742.00
Organism:Rattus norvegicus
Description:ChEMBL_88824
Residue:50
BDBM50217933
NameBDBM50217933
Synonyms:CHEMBL115057
TypeSmall organic molecule
Emp. Form.C40H62O11Si
Mol. Mass.746.9992
SMILES[H][C@]1(C\C=C(/C)\C=C\[C@H](O[SiH2]C(C)(C)C)[C@@H](C)\C=C\C(O)=O)O[C@]2(CC[C@@H]1C)CC[C@@](CCCC)(OC(=O)CCC(O)=O)[C@@]([H])(O2)\C=C\C(\C)=C\C(O)=O