Reaction Details
TargetIsoleucyl-tRNA synthetase
LigandBDBM50217936
Substrate/Competitorn/a
Meas. Tech.ChEMBL_88825 (CHEMBL698880)
IC50<1490±n/a nM
Citation Shimizu, TUsui, TMachida, KFuruya, KOsada, HNakata, T Chemical modification of reveromycin A and its biological activities. Bioorg Med Chem Lett12:3363-6 (2002) Isoleucyl-tRNA synthetase
Name:Isoleucyl-tRNA synthetase
Synonyms:n/a
Type:PROTEIN
Mol. Mass.:5742.00
Organism:Rattus norvegicus
Description:ChEMBL_88824
Residue:50
BDBM50217936
NameBDBM50217936
Synonyms:CHEMBL115949
TypeSmall organic molecule
Emp. Form.C36H62O11
Mol. Mass.670.8709
SMILES[H][C@]1(CCC(C)CC[C@H](O)[C@@H](C)CCC(O)=O)O[C@]2(CC[C@@H]1C)CC[C@@](CCCC)(OC(=O)CCC(O)=O)[C@]([H])(CCC(C)CC(O)=O)O2