Reaction Details
TargetAlpha-2A adrenergic receptor [16-465]/Alpha-2B adrenergic receptor/Alpha-2C adrenergic receptor
LigandBDBM50109283
Substrate/Competitorn/a
Meas. Tech.ChEMBL_34223 (CHEMBL648717)
Ki 16±n/a nM
Citation Betti, LBotta, MCorelli, FFloridi, MFossa, PGiannaccini, GManetti, FStrappaghetti, GCorsano, S alpha(1)-Adrenoceptor antagonists. Rational design, synthesis and biological evaluation of new trazodone-like compounds. Bioorg Med Chem Lett12:437-40 (2002) Alpha-2A adrenergic receptor [16-465]/Alpha-2B adrenergic receptor/Alpha-2C adrenergic receptor
Name:Alpha-2A adrenergic receptor [16-465]/Alpha-2B adrenergic receptor/Alpha-2C adrenergic receptor
Synonyms:Adrenergic receptor alpha-2
Type:n/a
Mol. Mass.:n/a
Description:ASSAY_ID of ChEMBL is 935397
Components:This complex has 3 components.
Component 1
Name:Alpha-2C adrenergic receptor
Type:Enzyme Catalytic Domain
Mol. Mass.:49890.50
Organism:RAT
Description:adrenergic Alpha2 0 RAT::P22086
Residue:458
Component 2
Name:Alpha-2B adrenergic receptor
Synonyms:ADA2B_RAT Adrenergic receptor alpha Alpha-2B adrenergic receptor Alpha-2B adrenoreceptor | adrenergic Alpha2B
Type:Enzyme Catalytic Domain
Mol. Mass.:50379.83
Organism:NEONATAL RAT
Description:adrenergic Alpha2B ADRA2B NEONATAL RAT::P19328
Residue:453
Component 3
Name:Alpha-2A adrenergic receptor [16-465]
Synonyms:ADA2A_RAT Adrenaline 2 Alpha-2A adrenoceptor Alpha-2AAR Alpha2 Adrenoreceptor adrenergic Alpha2A
Type:G-protein coupled receptor
Mol. Mass.:48961.69
Organism:Rattus norvegicus (rat)
Description:P22909[16-465]
Residue:450
BDBM50109283
NameBDBM50109283
Synonyms:6-(1H-benzo[d]imidazol-1-yl)-2-(4-(4-(2-methoxyphenyl)piperazin-1-yl)butyl)pyridazin-3(2H)-one CHEMBL120455
TypeSmall organic molecule
Emp. Form.C26H30N6O2
Mol. Mass.458.5554
SMILESCOc1ccccc1N1CCN(CCCCn2nc(ccc2=O)-n2cnc3ccccc23)CC1