Reaction Details
Target5-hydroxytryptamine receptor 7
LigandBDBM50220557
Substrate/Competitorn/a
Meas. Tech.ChEMBL_3707 (CHEMBL875101)
Ki 2.0±n/a nM
Citation Kikuchi, CSuzuki, HHiranuma, TKoyama, M New tetrahydrobenzindoles as potent and selective 5-HT(7) antagonists with increased In vitro metabolic stability. Bioorg Med Chem Lett13:61-4 (2003) 5-hydroxytryptamine receptor 7
Name:5-hydroxytryptamine receptor 7
Type:G Protein-Coupled Receptor (GPCR)
Mol. Mass.:53573.08
Organism:Homo sapiens (Human)
Description:P34969
Residue:479
BDBM50220557
NameBDBM50220557
Synonyms:CHEMBL422869
TypeSmall organic molecule
Emp. Form.C26H28ClFN2O
Mol. Mass.438.965
SMILESFc1ccc(cc1)C1=CCN(CCCCC23CCCc4c2c(NC3=O)ccc4Cl)CC1