Reaction Details
TargetHistone deacetylase
LigandBDBM50220741
Substrate/Competitorn/a
Meas. Tech.ChEMBL_87711 (CHEMBL697495)
IC50 12187±n/a nM
Citation Van Ommeslaeghe, KElaut, GBrecx, VPapeleu, PIterbeke, KGeerlings, PTourwé, DRogiers, V Amide analogues of TSA: synthesis, binding mode analysis and HDAC inhibition. Bioorg Med Chem Lett13:1861-4 (2003) Histone deacetylase
Name:Histone deacetylase
Type:PROTEIN
Mol. Mass.:34754.92
Organism:Rattus norvegicus
Description:ChEMBL_104809
Residue:328
BDBM50220741
NameBDBM50220741
Synonyms:CHEMBL417594
TypeSmall organic molecule
Emp. Form.C16H21N3O3
Mol. Mass.303.3562
SMILESC[C@@H](NC(=O)c1ccc(cc1)N(C)C)\C=C\C=C\C(=O)NO