Reaction Details
TargetAlpha-1A adrenergic receptor
LigandBDBM50220744
Substrate/Competitorn/a
Meas. Tech.ChEMBL_33887 (CHEMBL643759)
Ki 0.316228±n/a nM
Citation Lopez, FJArias, LChan, RClarke, DEElworthy, TRFord, APGuzman, AJaime-Figueroa, SJasper, JRMorgans, DJPadilla, FPerez-Medrano, AQuintero, CRomero, MSandoval, LSmith, SAWilliams, TJBlue, DR Synthesis, pharmacology and pharmacokinetics of 3-(4-aryl-piperazin-1-ylalkyl)-uracils as uroselective alpha1A-antagonists. Bioorg Med Chem Lett13:1873-8 (2003) Alpha-1A adrenergic receptor
Name:Alpha-1A adrenergic receptor
Type:Cell-surface receptors
Mol. Mass.:51511.67
Organism:Homo sapiens (Human)
Description:P35348
Residue:466
BDBM50220744
NameBDBM50220744
Synonyms:CHEMBL55290
TypeSmall organic molecule
Emp. Form.C19H24F3N5O3
Mol. Mass.427.4208
SMILESCc1n[nH]c(=O)n(CCCN2CCN(CC2)c2ccccc2OCC(F)(F)F)c1=O