Reaction Details
TargetAlpha-1D adrenergic receptor
LigandBDBM50220782
Substrate/Competitorn/a
Meas. Tech.ChEMBL_32602 (CHEMBL642129)
Ki 25±n/a nM
Citation Lopez, FJArias, LChan, RClarke, DEElworthy, TRFord, APGuzman, AJaime-Figueroa, SJasper, JRMorgans, DJPadilla, FPerez-Medrano, AQuintero, CRomero, MSandoval, LSmith, SAWilliams, TJBlue, DR Synthesis, pharmacology and pharmacokinetics of 3-(4-aryl-piperazin-1-ylalkyl)-uracils as uroselective alpha1A-antagonists. Bioorg Med Chem Lett13:1873-8 (2003) Alpha-1D adrenergic receptor
Name:Alpha-1D adrenergic receptor
Type:Enzyme Catalytic Domain
Mol. Mass.:60485.82
Organism:Homo sapiens (Human)
Description:adrenergic Alpha1D ADRA1D HUMAN::P25100
Residue:572
BDBM50220782
NameBDBM50220782
Synonyms:CHEMBL53675
TypeSmall organic molecule
Emp. Form.C21H26F4N4O3
Mol. Mass.458.4498
SMILESCCc1c[nH]c(=O)n(CCCN2CCN(CC2)c2ccc(F)cc2OCC(F)(F)F)c1=O