Reaction Details
TargetAlpha-1A adrenergic receptor
LigandBDBM50220779
Substrate/Competitorn/a
Meas. Tech.ChEMBL_33887 (CHEMBL643759)
Ki 1.000000±n/a nM
Citation Lopez, FJArias, LChan, RClarke, DEElworthy, TRFord, APGuzman, AJaime-Figueroa, SJasper, JRMorgans, DJPadilla, FPerez-Medrano, AQuintero, CRomero, MSandoval, LSmith, SAWilliams, TJBlue, DR Synthesis, pharmacology and pharmacokinetics of 3-(4-aryl-piperazin-1-ylalkyl)-uracils as uroselective alpha1A-antagonists. Bioorg Med Chem Lett13:1873-8 (2003) Alpha-1A adrenergic receptor
Name:Alpha-1A adrenergic receptor
Type:Cell-surface receptors
Mol. Mass.:51511.67
Organism:Homo sapiens (Human)
Description:P35348
Residue:466
BDBM50220779
NameBDBM50220779
Synonyms:CHEMBL298838
TypeSmall organic molecule
Emp. Form.C19H21ClF4N4O3
Mol. Mass.464.842
SMILESFc1ccc(N2CCN(CCCn3c(=O)[nH]cc(Cl)c3=O)CC2)c(OCC(F)(F)F)c1