Reaction Details
TargetcAMP-specific 3',5'-cyclic phosphodiesterase 4C
LigandBDBM50220994
Substrate/Competitorn/a
Meas. Tech.ChEMBL_157378 (CHEMBL763643)
Ki>5.0±n/a nM
Citation Kim, EChun, HOJung, SHKim, JHLee, JMSuh, BCXiang, MXRhee, CK Improvement of therapeutic index of phosphodiesterase type IV inhibitors as anti-Asthmatics. Bioorg Med Chem Lett13:2355-8 (2003) cAMP-specific 3',5'-cyclic phosphodiesterase 4C
Name:cAMP-specific 3',5'-cyclic phosphodiesterase 4C
Type:PROTEIN
Mol. Mass.:60038.21
Organism:Rattus norvegicus
Description:ChEMBL_104732
Residue:536
BDBM50220994
NameBDBM50220994
Synonyms:CHEMBL77177
TypeSmall organic molecule
Emp. Form.C14H20N4O2
Mol. Mass.276.3342
SMILES[#6]-[#8]-c1ccc(\[#6]=[#7]\[#7]=[#6](/[#7])-[#7])cc1-[#8]-[#6]-1-[#6]-[#6]-[#6]-[#6]-1