Reaction Details
TargetDNA topoisomerase 2-alpha/2-beta
LigandBDBM50221011
Substrate/Competitorn/a
Meas. Tech.ChEMBL_75719 (CHEMBL687374)
IC50 8610±n/a nM
Citation Gray, JLAlmstead, JIGallagher, CPHu, XEKim, NKTaylor, CJTwinem, TLWallace, CDLedoussal, B Synthesis and biological testing of non-fluorinated analogues of levofloxacin. Bioorg Med Chem Lett13:2373-5 (2003) DNA topoisomerase 2-alpha/2-beta
Name:DNA topoisomerase 2-alpha/2-beta
Synonyms:DNA topoisomerase II
Type:n/a
Mol. Mass.:n/a
Description:ASSAY_ID of ChEMBL is 1821483
Components:This complex has 2 components.
Component 1
Name:DNA topoisomerase 2-alpha
Type:Protein
Mol. Mass.:174415.30
Organism:Homo sapiens (Human)
Description:P11388
Residue:1531
Component 2
Name:DNA topoisomerase 2-beta
Synonyms:DNA topoisomerase II TOP2B | TOP2B_HUMAN
Type:PROTEIN
Mol. Mass.:183284.13
Organism:Homo sapiens (Human)
Description:ChEMBL_51583
Residue:1626
BDBM50221011
NameBDBM50221011
Synonyms:CHEMBL76485
TypeSmall organic molecule
Emp. Form.C20H25N3O4
Mol. Mass.371.4302
SMILESC[C@H]1COc2c(ccc3c2n1cc(C(O)=O)c3=O)N1CC[C@H](C1)C(C)(C)N