Reaction Details
TargetUDP-N-acetylmuramoylalanine--D-glutamate ligase
LigandBDBM50221035
Substrate/Competitorn/a
Meas. Tech.ChEMBL_212282 (CHEMBL819149)
IC50>105000±n/a nM
Citation Li, ZFrancisco, GDHu, WLabthavikul, PPetersen, PJSeverin, ASingh, GYang, YRasmussen, BALin, YISkotnicki, JSMansour, TS 2-Phenyl-5,6-dihydro-2H-thieno[3,2-c]pyrazol-3-ol derivatives as new inhibitors of bacterial cell wall biosynthesis. Bioorg Med Chem Lett13:2591-4 (2003) UDP-N-acetylmuramoylalanine--D-glutamate ligase
Name:UDP-N-acetylmuramoylalanine--D-glutamate ligase
Type:Protein
Mol. Mass.:49837.61
Organism:Staphylococcus aureus (Firmicutes)
Description:S. aureus MurD
Residue:449
BDBM50221035
NameBDBM50221035
Synonyms:CHEMBL86990
TypeSmall organic molecule
Emp. Form.C11H9FN2OS
Mol. Mass.236.265
SMILESOc1c2SCCc2nn1-c1ccc(F)cc1