Reaction Details
TargetUDP-N-acetylmuramate--L-alanine ligase
LigandBDBM50221033
Substrate/Competitorn/a
Meas. Tech.ChEMBL_212278 (CHEMBL816141)
IC50>95600±n/a nM
Citation Li, ZFrancisco, GDHu, WLabthavikul, PPetersen, PJSeverin, ASingh, GYang, YRasmussen, BALin, YISkotnicki, JSMansour, TS 2-Phenyl-5,6-dihydro-2H-thieno[3,2-c]pyrazol-3-ol derivatives as new inhibitors of bacterial cell wall biosynthesis. Bioorg Med Chem Lett13:2591-4 (2003) UDP-N-acetylmuramate--L-alanine ligase
Name:UDP-N-acetylmuramate--L-alanine ligase
Type:Protein
Mol. Mass.:49159.53
Organism:Staphylococcus aureus (Firmicutes)
Description:S. aureus MurC
Residue:437
BDBM50221033
NameBDBM50221033
Synonyms:CHEMBL420601
TypeSmall organic molecule
Emp. Form.C12H11N3O2S
Mol. Mass.261.3
SMILESNC(=O)c1cccc(c1)-n1nc2CCSc2c1O