Reaction Details
TargetUDP-N-acetylmuramate--L-alanine ligase
LigandBDBM50221038
Substrate/Competitorn/a
Meas. Tech.ChEMBL_212278 (CHEMBL816141)
IC50 24300±n/a nM
Citation Li, ZFrancisco, GDHu, WLabthavikul, PPetersen, PJSeverin, ASingh, GYang, YRasmussen, BALin, YISkotnicki, JSMansour, TS 2-Phenyl-5,6-dihydro-2H-thieno[3,2-c]pyrazol-3-ol derivatives as new inhibitors of bacterial cell wall biosynthesis. Bioorg Med Chem Lett13:2591-4 (2003) UDP-N-acetylmuramate--L-alanine ligase
Name:UDP-N-acetylmuramate--L-alanine ligase
Type:Protein
Mol. Mass.:49159.53
Organism:Staphylococcus aureus (Firmicutes)
Description:S. aureus MurC
Residue:437
BDBM50221038
NameBDBM50221038
Synonyms:CHEMBL87521
TypeSmall organic molecule
Emp. Form.C11H8Cl2N2OS
Mol. Mass.287.165
SMILESOc1c2SCCc2nn1-c1ccc(Cl)c(Cl)c1