Reaction Details
TargetHistone deacetylase (HDAC1 and HDAC2)
LigandBDBM50221786
Substrate/Competitorn/a
Meas. Tech.ChEMBL_87403 (CHEMBL693167)
IC50 0.109000±n/a nM
Citation Wada, CKFrey, RRJi, ZCurtin, MLGarland, RBHolms, JHLi, JPease, LJGuo, JGlaser, KBMarcotte, PARichardson, PLMurphy, SSBouska, JJTapang, PMagoc, TJAlbert, DHDavidsen, SKMichaelides, MR Alpha-keto amides as inhibitors of histone deacetylase. Bioorg Med Chem Lett13:3331-5 (2003) Histone deacetylase (HDAC1 and HDAC2)
Name:Histone deacetylase (HDAC1 and HDAC2)
Type:n/a
Mol. Mass.:n/a
Description:ASSAY_ID of ChEMBL is 2197604
Components:This complex has 2 components.
Component 1
Name:Histone deacetylase 1
Synonyms:Cereblon/Histone deacetylase 1 HDAC1 Histone deacetylase 1 (HDAC1) RPD3L1
Type:Enzyme
Mol. Mass.:55090.27
Organism:Homo sapiens (Human)
Description:Q13547
Residue:482
Component 2
Name:Histone deacetylase 2
Synonyms:Cereblon/Histone deacetylase 2 HDAC2 Histone deacetylase 2 (HDAC2) | Human HDAC2
Type:Chromatin regulator; hydrolase; repressor
Mol. Mass.:55356.54
Organism:Homo sapiens (Human)
Description:Q92769
Residue:488
BDBM50221786
NameBDBM50221786
Synonyms:CHEMBL432243
TypeSmall organic molecule
Emp. Form.C22H26O4
Mol. Mass.354.4394
SMILESCOC(=O)C(=O)CCCCCCCOc1ccc(cc1)-c1ccccc1