Reaction Details
TargetMitogen-activated protein kinase 11/12/13/14
LigandBDBM50222107
Substrate/Competitorn/a
Meas. Tech.ChEMBL_206496 (CHEMBL807827)
IC50 1.6±n/a nM
Citation Natarajan, SRWisnoski, DDSingh, SBStelmach, JEO'Neill, EASchwartz, CDThompson, CMFitzgerald, CEO'Keefe, SJKumar, SHop, CEZaller, DMSchmatz, DMDoherty, JB p38MAP kinase inhibitors. Part 1: design and development of a new class of potent and highly selective inhibitors based on 3,4-dihydropyrido[3,2-d]pyrimidone scaffold. Bioorg Med Chem Lett13:273-6 (2003) Mitogen-activated protein kinase 11/12/13/14
Name:Mitogen-activated protein kinase 11/12/13/14
Synonyms:MAP kinase p38
Type:n/a
Mol. Mass.:n/a
Description:ASSAY_ID of ChEMBL is 1935922
Components:This complex has 4 components.
Component 1
Name:Mitogen-activated protein kinase 13
Type:Enzyme
Mol. Mass.:42097.16
Organism:Homo sapiens (Human)
Description:O15264
Residue:365
Component 2
Name:Mitogen-activated protein kinase 11
Synonyms:MAP kinase p38 MK11_HUMAN Mitogen-activated protein kinase p38 beta SAPK2 Stress-activated protein kinase 2 p38-2 p38b
Type:Enzyme Catalytic Domain
Mol. Mass.:41351.73
Organism:Homo sapiens (Human)
Description:gi_20128774
Residue:364
Component 3
Name:Mitogen-activated protein kinase 14
Synonyms:CSAID-binding protein CSBP1 CSPB1 MAP kinase 14 MAP kinase p38 alpha MAPK14 MK14_HUMAN Mitogen-activated protein kinase p38 alpha Stress-activated protein kinase 2a | p38 MAP kinase alpha/beta
Type:Serine/threonine-protein kinase
Mol. Mass.:41286.76
Organism:Homo sapiens (Human)
Description:Q16539
Residue:360
Component 4
Name:Mitogen-activated protein kinase 12
Synonyms:ERK6 MAPK12 Mitogen-activated protein kinase 12 (MAPK12 p38 gamma) Mitogen-activated protein kinase 12 Gamma SAPK3 | p38 delta/gamma
Type:Protein
Mol. Mass.:41938.69
Organism:Homo sapiens (Human)
Description:P53778
Residue:367
BDBM50222107
NameBDBM50222107
Synonyms:CHEMBL93650
TypeSmall organic molecule
Emp. Form.C27H25Cl2F2N5OS
Mol. Mass.576.488
SMILESCC(C)N1CC2CC1CN2c1cc2N(C(=O)NCc2nc1Sc1ccc(F)cc1F)c1c(Cl)cccc1Cl