Reaction Details
TargetNeuraminidase
LigandBDBM50222706
Substrate/Competitorn/a
Meas. Tech.ChEMBL_200796 (CHEMBL808320)
IC50 28.7±n/a nM
Citation Masuda, TShibuya, SArai, MYoshida, STomozawa, TOhno, AYamashita, MHonda, T Synthesis and anti-influenza evaluation of orally active bicyclic ether derivatives related to zanamivir. Bioorg Med Chem Lett13:669-73 (2003) Neuraminidase
Name:Neuraminidase
Type:Enzyme
Mol. Mass.:50124.14
Organism:Influenza A virus (A/Puerto Rico/8/34/Mount Sinai(H1N1))
Description:P03468
Residue:454
BDBM50222706
NameBDBM50222706
Synonyms:CHEMBL159225
TypeSmall organic molecule
Emp. Form.C14H22N4O7
Mol. Mass.358.3471
SMILES[H][C@]1(OCC[C@@H](O)[C@H]1O)[C@]1([H])OC(=C[C@H](NC(N)=N)[C@H]1NC(C)=O)C(O)=O