Reaction Details
TargetProstacyclin receptor
LigandBDBM50223826
Substrate/Competitorn/a
Meas. Tech.ChEMBL_157784 (CHEMBL857865)
Ki 3162±n/a nM
Citation Clark, RDJahangir, ASeverance, DSalazar, RChang, TChang, DJett, MFSmith, SBley, K Discovery and SAR development of 2-(phenylamino) imidazolines as prostacyclin receptor antagonists [corrected]. Bioorg Med Chem Lett14:1053-6 (2004) Prostacyclin receptor
Name:Prostacyclin receptor
Type:G Protein-Coupled Receptor (GPCR)
Mol. Mass.:40968.22
Organism:Homo sapiens (Human)
Description:The membranes prepared from human platelet were used in binding assay.
Residue:386
BDBM50223826
NameBDBM50223826
Synonyms:CHEMBL9583
TypeSmall organic molecule
Emp. Form.C15H21N3S
Mol. Mass.275.412
SMILESC1CN=C(Nc2ccc(SC3CCCCC3)cc2)N1