Reaction Details
TargetProstacyclin receptor
LigandBDBM50223854
Substrate/Competitorn/a
Meas. Tech.ChEMBL_157784 (CHEMBL857865)
Ki 158±n/a nM
Citation Clark, RDJahangir, ASeverance, DSalazar, RChang, TChang, DJett, MFSmith, SBley, K Discovery and SAR development of 2-(phenylamino) imidazolines as prostacyclin receptor antagonists [corrected]. Bioorg Med Chem Lett14:1053-6 (2004) Prostacyclin receptor
Name:Prostacyclin receptor
Type:G Protein-Coupled Receptor (GPCR)
Mol. Mass.:40968.22
Organism:Homo sapiens (Human)
Description:The membranes prepared from human platelet were used in binding assay.
Residue:386
BDBM50223854
NameBDBM50223854
Synonyms:CHEMBL9573
TypeSmall organic molecule
Emp. Form.C16H17N3O3S
Mol. Mass.331.389
SMILESCOc1ccc(cc1)S(=O)(=O)c1ccc(NC2=NCCN2)cc1