Reaction Details
TargetProstacyclin receptor
LigandBDBM50223859
Substrate/Competitorn/a
Meas. Tech.ChEMBL_157784 (CHEMBL857865)
Ki 631±n/a nM
Citation Clark, RDJahangir, ASeverance, DSalazar, RChang, TChang, DJett, MFSmith, SBley, K Discovery and SAR development of 2-(phenylamino) imidazolines as prostacyclin receptor antagonists [corrected]. Bioorg Med Chem Lett14:1053-6 (2004) Prostacyclin receptor
Name:Prostacyclin receptor
Type:G Protein-Coupled Receptor (GPCR)
Mol. Mass.:40968.22
Organism:Homo sapiens (Human)
Description:The membranes prepared from human platelet were used in binding assay.
Residue:386
BDBM50223859
NameBDBM50223859
Synonyms:CHEMBL9868
TypeSmall organic molecule
Emp. Form.C16H17N3OS
Mol. Mass.299.391
SMILESCOc1ccc(Sc2ccccc2NC2=NCCN2)cc1