Reaction Details
TargetGonadotropin-releasing hormone receptor
LigandBDBM50001573
Substrate/Competitorn/a
Meas. Tech.ChEMBL_100015 (CHEMBL709253)
Ki 22±n/a nM
Citation Randolph, JTSauer, DRHaviv, FNilius, AMGreer, J Elimination of antibacterial activities of non-peptide luteinizing hormone-releasing hormone (LHRH) antagonists derived from erythromycin A. Bioorg Med Chem Lett14:1599-602 (2004) Gonadotropin-releasing hormone receptor
Name:Gonadotropin-releasing hormone receptor
Type:Enzyme
Mol. Mass.:37749.45
Organism:Homo sapiens (Human)
Description:P30968
Residue:328
BDBM50001573
NameBDBM50001573
Synonyms:CHEMBL273387
TypeSmall organic molecule
Emp. Form.C49H79ClN2O13
Mol. Mass.939.61
SMILES[H][C@@]12[C@@H](C)C(=O)[C@H](C)C[C@](C)(OC)[C@H](OC3O[C@H](C)C[C@@H]([C@H]3O)N(C)C(C)C)[C@@H](C)[C@H](OC3C[C@@](C)(OC)[C@@H](O)[C@H](C)O3)[C@@H](C)C(=O)O[C@H](CC)[C@@]1(C)OC(=O)N2CCc1ccc(Cl)cc1