Reaction Details
TargetCholesterol side-chain cleavage enzyme, mitochondrial
LigandBDBM50221745
Substrate/Competitorn/a
Meas. Tech.ChEMBL_63920 (CHEMBL677327)
IC50 110000±n/a nM
Citation Hazra, BPore, VDey, SDatta, SDarokar, MSaikia, DKhanuja, SPThakur, A Bile acid amides derived from chiral amino alcohols: novel antimicrobials and antifungals. Bioorg Med Chem Lett14:773-7 (2004) Cholesterol side-chain cleavage enzyme, mitochondrial
Name:Cholesterol side-chain cleavage enzyme, mitochondrial
Type:PROTEIN
Mol. Mass.:60603.33
Organism:Rattus norvegicus
Description:ChEMBL_50353
Residue:526
BDBM50221745
NameBDBM50221745
Synonyms:CHEMBL350726
TypeSmall organic molecule
Emp. Form.C33H51NO5
Mol. Mass.541.7617
SMILES[H][C@@]1(CC[C@@]2([H])[C@]3([H])CC[C@]4([H])C[C@H](O)CC[C@]4(C)[C@@]3([H])C[C@H](O)[C@]12C)[C@H](C)CCC(=O)N[C@H](CO)[C@H](O)c1ccccc1