Reaction Details
TargetcAMP-specific 3',5'-cyclic phosphodiesterase 4C
LigandBDBM14754
Substrate/Competitorn/a
Meas. Tech.ChEMBL_155708 (CHEMBL760586)
Ki 8000±n/a nM
Comments0.000008 20220122
Citation Temple, DLYevich, JPCatt, JDOwens, DHanning, CCovington, RRSeidehamel, RJDungan, KW Substituted 6,7-dihydroimidazo[1,2-a]purin-9(4H)-ones. J Med Chem23:1188-98 (1980) cAMP-specific 3',5'-cyclic phosphodiesterase 4C
Name:cAMP-specific 3',5'-cyclic phosphodiesterase 4C
Type:PROTEIN
Mol. Mass.:60038.21
Organism:Rattus norvegicus
Description:ChEMBL_104732
Residue:536
BDBM14754
NameBDBM14754
Synonyms:1-[(3,4-dimethoxyphenyl)methyl]-6,7-dimethoxy-isoquinoline 6,7-dimethoxy-1-veratryl-isoquinoline;hydrochloride Papaverine
TypeSmall organic molecule
Emp. Form.C20H21NO4
Mol. Mass.339.385
SMILESCOc1ccc(Cc2nccc3cc(OC)c(OC)cc23)cc1OC