Reaction Details
TargetDihydrofolate reductase
LigandBDBM50291799
Substrate/Competitorn/a
Meas. Tech.ChEMBL_54925 (CHEMBL857514)
Ki 2.9±n/a nM
Citation Coats, EAGenther, CSDietrich, SWGuo, ZRHansch, C Comparison of the inhibition of methotrexate-sensitive and -resistant Lactobacillus casei cell cultures with purified Lactobacillus casei dihydrofolate reductase by 4,6-diamino-1,2-dihydro-2,2-dimethyl-1-(3-substituted-phenyl)-s-triazines. Use of quantitative structure-activity relationships in maki J Med Chem24:1422-9 (1981) Dihydrofolate reductase
Name:Dihydrofolate reductase
Type:PROTEIN
Mol. Mass.:18437.08
Organism:Lactobacillus casei
Description:ChEMBL_1357878
Residue:163
BDBM50291799
NameBDBM50291799
Synonyms:1-[3-(4,6-Diamino-2,2-dimethyl-2H-[1,3,5]triazin-1-yl)-phenyl]-ethanone | CHEMBL6755
TypeSmall organic molecule
Emp. Form.C13H17N5O
Mol. Mass.259.307
SMILESCC(=O)c1cccc(c1)N1C(N)=NC(N)=NC1(C)C