Reaction Details
TargetDihydrofolate reductase
LigandBDBM50405087
Substrate/Competitorn/a
Meas. Tech.ChEMBL_54925 (CHEMBL857514)
Ki 4.2±n/a nM
Citation Coats, EAGenther, CSDietrich, SWGuo, ZRHansch, C Comparison of the inhibition of methotrexate-sensitive and -resistant Lactobacillus casei cell cultures with purified Lactobacillus casei dihydrofolate reductase by 4,6-diamino-1,2-dihydro-2,2-dimethyl-1-(3-substituted-phenyl)-s-triazines. Use of quantitative structure-activity relationships in maki J Med Chem24:1422-9 (1981) Dihydrofolate reductase
Name:Dihydrofolate reductase
Type:PROTEIN
Mol. Mass.:18437.08
Organism:Lactobacillus casei
Description:ChEMBL_1357878
Residue:163
BDBM50405087
NameBDBM50405087
Synonyms:CHEMBL7435
TypeSmall organic molecule
Emp. Form.C15H23N5O
Mol. Mass.289.376
SMILESCCCCOc1cccc(c1)N1C(N)=NC(N)=NC1(C)C