Reaction Details
TargetDihydrofolate reductase
LigandBDBM50291805
Substrate/Competitorn/a
Meas. Tech.ChEMBL_54925 (CHEMBL857514)
Ki 4.8±n/a nM
Citation Coats, EAGenther, CSDietrich, SWGuo, ZRHansch, C Comparison of the inhibition of methotrexate-sensitive and -resistant Lactobacillus casei cell cultures with purified Lactobacillus casei dihydrofolate reductase by 4,6-diamino-1,2-dihydro-2,2-dimethyl-1-(3-substituted-phenyl)-s-triazines. Use of quantitative structure-activity relationships in maki J Med Chem24:1422-9 (1981) Dihydrofolate reductase
Name:Dihydrofolate reductase
Type:PROTEIN
Mol. Mass.:18437.08
Organism:Lactobacillus casei
Description:ChEMBL_1357878
Residue:163
BDBM50291805
NameBDBM50291805
Synonyms:6,6-Dimethyl-1-{3-[4-(3-trifluoromethyl-phenoxy)-butoxy]-phenyl}-1,6-dihydro-[1,3,5]triazine-2,4-diamine | CHEMBL6671
TypeSmall organic molecule
Emp. Form.C22H26F3N5O2
Mol. Mass.449.4693
SMILESCC1(C)N=C(N)N=C(N)N1c1cccc(OCCCCOc2cccc(c2)C(F)(F)F)c1