Reaction Details
TargetDihydrofolate reductase
LigandBDBM50090054
Substrate/Competitorn/a
Meas. Tech.ChEMBL_54925 (CHEMBL857514)
Ki 3.5±n/a nM
Citation Coats, EAGenther, CSDietrich, SWGuo, ZRHansch, C Comparison of the inhibition of methotrexate-sensitive and -resistant Lactobacillus casei cell cultures with purified Lactobacillus casei dihydrofolate reductase by 4,6-diamino-1,2-dihydro-2,2-dimethyl-1-(3-substituted-phenyl)-s-triazines. Use of quantitative structure-activity relationships in maki J Med Chem24:1422-9 (1981) Dihydrofolate reductase
Name:Dihydrofolate reductase
Type:PROTEIN
Mol. Mass.:18437.08
Organism:Lactobacillus casei
Description:ChEMBL_1357878
Residue:163
BDBM50090054
NameBDBM50090054
Synonyms:1-(3-Chloro-phenyl)-6,6-dimethyl-1,6-dihydro-[1,3,5]triazine-2,4-diamine CHEMBL7130
TypeSmall organic molecule
Emp. Form.C11H14ClN5
Mol. Mass.251.715
SMILESCC1(C)N=C(N)N=C(N)N1c1cccc(Cl)c1