Reaction Details
TargetD(1A)/D(2) dopamine receptor
LigandBDBM50224035
Substrate/Competitorn/a
Meas. Tech.ChEMBL_59597 (CHEMBL672154)
IC50 23700±n/a nM
Citation Cannon, JGPerez, JABhatnagar, RKLong, JPSharabi, FM Conformationally restricted congeners of dopamine derived from 2-aminoindan. J Med Chem25:1442-6 (1982) D(1A)/D(2) dopamine receptor
Name:D(1A)/D(2) dopamine receptor
Synonyms:Dopamine receptor
Type:n/a
Mol. Mass.:n/a
Description:ASSAY_ID of ChEMBL is 59578
Components:This complex has 2 components.
Component 1
Name:D(2) dopamine receptor
Type:Enzyme Catalytic Domain
Mol. Mass.:50698.79
Organism:BOVINE
Description:P20288
Residue:444
Component 2
Name:D(1A) dopamine receptor
Synonyms:D(1A) dopamine receptor DOPAMINE D1 DRD1_BOVIN | Dopamine receptor
Type:Enzyme Catalytic Domain
Mol. Mass.:49330.65
Organism:BOVINE
Description:DOPAMINE D1 DRD1 BOVINE::Q95136
Residue:446
BDBM50224035
NameBDBM50224035
Synonyms:79907 | Lergotrile
TypeSmall organic molecule
Emp. Form.C17H18ClN3
Mol. Mass.299.798
SMILES[H][C@@]12Cc3c(Cl)[nH]c4cccc(c34)[C@@]1([H])C[C@@H](CC#N)CN2C