Reaction Details
TargetDelta-type opioid receptor/Kappa-type opioid receptor/Mu-type opioid receptor/Sigma non-opioid intracellular receptor 1
LigandBDBM50224274
Substrate/Competitorn/a
Meas. Tech.ChEMBL_147640 (CHEMBL757324)
IC50 18±n/a nM
Citation Kobylecki, RJCarling, RWLord, JASmith, CFLane, AC Common anionic receptor site hypothesis: its relevance to the antagonist action of naloxone. J Med Chem25:116-20 (1982) Delta-type opioid receptor/Kappa-type opioid receptor/Mu-type opioid receptor/Sigma non-opioid intracellular receptor 1
Name:Delta-type opioid receptor/Kappa-type opioid receptor/Mu-type opioid receptor/Sigma non-opioid intracellular receptor 1
Synonyms:Opioid receptor
Type:n/a
Mol. Mass.:n/a
Description:ASSAY_ID of ChEMBL is 172778
Components:This complex has 4 components.
Component 1
Name:Mu-type opioid receptor
Type:G Protein-Coupled Receptor (GPCR)
Mol. Mass.:44503.11
Organism:Rattus norvegicus (rat)
Description:Competition binding assays were carried out using membrane preparations from transfected HN9.10 cells that constitutively expressed the mu opioid receptor.
Residue:398
Component 2
Name:Sigma non-opioid intracellular receptor 1
Synonyms:Opioid receptor SGMR1_RAT Sigma non-opioid intracellular receptor 1 Sigma-1 | Sigmar1
Type:Enzyme Catalytic Domain
Mol. Mass.:25266.54
Organism:RAT
Description:Q9R0C9
Residue:223
Component 3
Name:Kappa-type opioid receptor
Synonyms:KOR-1 OPIATE Kappa Opioid receptor Ror-d
Type:G Protein-Coupled Receptor (GPCR)
Mol. Mass.:42692.90
Organism:Rattus norvegicus (rat)
Description:P34975
Residue:380
Component 4
Name:Delta-type opioid receptor
Synonyms:Cytochrome P450 3A4 Delta opioid receptor Delta-type opioid receptor (DOR) OPRD_RAT Opioid receptor Opioid receptors; mu & delta Ror-a | Voltage-gated potassium channel
Type:G Protein-Coupled Receptor (GPCR)
Mol. Mass.:40465.04
Organism:Rattus norvegicus (rat)
Description:Competition binding assays were using CHO-K1 cell membranes expressing the opioid receptor.
Residue:372
BDBM50224274
NameBDBM50224274
Synonyms:CHEMBL2304423
TypeSmall organic molecule
Emp. Form.C21H25NO4
Mol. Mass.355.4275
SMILES[H][C@@]12Oc3c4c(C[C@@]5([H])N(CC6CC6)CC[C@@]14[C@]5(CCC2=O)OC)ccc3O