Reaction Details
TargetDihydrofolate reductase
LigandBDBM50029760
Substrate/Competitorn/a
Meas. Tech.ChEMBL_53931 (CHEMBL669353)
pH7.2±n/a
Ki 13183±n/a nM
Commentsextracted
Citation Li, RHansch, CKaufman, BT A comparison of the inhibitory action of 5-(substituted-benzyl)-2,4-diaminopyrimidines on dihydrofolate reductase from chicken liver with that from bovine liver. J Med Chem25:435-40 (1982) Dihydrofolate reductase
Name:Dihydrofolate reductase
Type:Enzyme
Mol. Mass.:21603.71
Organism:Bos taurus (Cattle)
Description:P00376
Residue:187
BDBM50029760
NameBDBM50029760
Synonyms:5-[3,5-Dimethoxy-4-(2-methoxy-ethoxy)-benzyl]-pyrimidine-2,4-diamine CHEMBL32039 | Tetroxoprim
TypeSmall organic molecule
Emp. Form.C16H22N4O4
Mol. Mass.334.3703
SMILESCOCCOc1c(OC)cc(Cc2cnc(N)nc2N)cc1OC