Reaction Details
TargetD(1A)/D(1B)/D(2)/D(3)/D(4) dopamine receptor
LigandBDBM50224794
Substrate/Competitorn/a
Meas. Tech.ChEMBL_60009 (CHEMBL675834)
IC50 60±n/a nM
Citation Anderson, PSBaldwin, JJMcClure, DELundell, GFJones, JHRandall, WCMartin, GEWilliams, MHirshfield, JMClineschmidt, BVLumma, PKRemy, DC Synthesis of (7R)-7H-indolo[3,4-gh][1,4]benzoxazines, a new class of D-heteroergolines with dopamine agonist activity. J Med Chem26:363-7 (1983) D(1A)/D(1B)/D(2)/D(3)/D(4) dopamine receptor
Name:D(1A)/D(1B)/D(2)/D(3)/D(4) dopamine receptor
Synonyms:Dopamine receptor
Type:n/a
Mol. Mass.:n/a
Description:ASSAY_ID of ChEMBL is 60018
Components:This complex has 5 components.
Component 1
Name:D(2) dopamine receptor
Type:G Protein-Coupled Receptor (GPCR)
Mol. Mass.:50931.60
Organism:Rattus norvegicus (rat)
Description:P61169
Residue:444
Component 2
Name:D(1A) dopamine receptor
Synonyms:DOPAMINE D1 Dopamine D1 high Dopamine receptor Dopamine1-like Drd1a
Type:Enzyme Catalytic Domain
Mol. Mass.:49429.75
Organism:RAT
Description:P18901
Residue:446
Component 3
Name:D(3) dopamine receptor
Synonyms:DOPAMINE D3 Dopamine D3 receptor | Drd3
Type:Protein
Mol. Mass.:49540.58
Organism:Rattus norvegicus (Rat)
Description:P19020
Residue:446
Component 4
Name:D(4) dopamine receptor
Synonyms:D(4) dopamine receptor DOPAMINE D4.4 Dopamine receptor | Drd4
Type:Enzyme Catalytic Domain
Mol. Mass.:41307.65
Organism:RAT
Description:DOPAMINE D4.4 0 RAT::P30729
Residue:387
Component 5
Name:D(1B) dopamine receptor
Synonyms:D(1B) dopamine receptor DRD5_RAT Dopamine D5 receptor Drd5
Type:Enzyme Catalytic Domain
Mol. Mass.:52827.88
Organism:RAT
Description:Dopamine D1B 0 RAT::P25115
Residue:475
BDBM50224794
NameBDBM50224794
Synonyms:CHEMBL121653
TypeSmall organic molecule
Emp. Form.C13H14N2O
Mol. Mass.214.2631
SMILES[H][C@@]12Cc3c[nH]c4cccc(c34)[C@@]1([H])OCCN2